{"text_format":"1","workbook":"xlsx","n_sheets":9,"sheets":["Loonadministratie","LS","JO","PK","personeelsoverzicht","po-kort","Loonstrook","Lonen","GV"],"not_rendered":{"charts":0,"images":3,"macros":1,"external_links":0,"defined_names":4,"comments":0,"pivot_tables":0},"unopened":[],"bounds":{"document_bytes":16777216,"sheet_cells":100000,"rows_first":2000,"rows_last":500,"rows_between":2000,"halvings":0,"cell_chars":16384,"cell_head_chars":4096},"cells_cut":0,"cells_raw":0,"read":"whole","date_system":"1900"}

{"sheet":"Loonadministratie","index":0,"n_rows":16,"n_cols":9,"rows_kept":16,"cut":false,"hidden":false,"merged":[[15,5,16,14]]}
[]
[]
[]
[]
[]
[]
[null,null,null,null,null,null,null,null,"Loonadministratie "]
[]
{"$rows_left_out":9}
{"sheet":"LS","index":1,"n_rows":52,"n_cols":8,"rows_kept":52,"cut":false,"hidden":false,"merged":[[7,3,7,4],[8,3,8,4],[9,3,9,4],[10,3,10,4]]}
[]
["Grondig B.V. "]
["Lage weide 419",null,null,null,null,"Januari"]
["3599 ZZ, Utrecht",null,null,null,null,"Februari"]
[null,null,null,null,null,"Maart"]
[null,null,null,null,null,"April"]
[null,null,null,null,null,"Mei"]
[{"$f":"_xlfn.XLOOKUP(D8, personeelsoverzicht!E:E, personeelsoverzicht!E:E)","v":"Marc Bakker"},null,"Medewerker: ","Marc Bakker",null,{"$f":"IF(D8=\"Naam\",\"Kies een naam of voer een naam in!\",\"\")","v":""}]
{"$rows_left_out":45}
{"sheet":"JO","index":2,"n_rows":38,"n_cols":5,"rows_kept":38,"cut":false,"hidden":false,"merged":[]}
[]
[null,"Jaaropgave",{"$f":"E7","v":2024}]
[]
[]
[]
[]
[null,"Elise Dijkstra",{"$f":"IF(B7=\"Naam\",\"Kies een naam of voer een naam in!\",\"\")","v":""},"Kies een jaar",2024]
[null,{"$f":"_xlfn.XLOOKUP(B7, personeelsoverzicht!E:E, personeelsoverzicht!I:I)","v":"Laan van Vollenhove 189"}]
{"$rows_left_out":31}
{"sheet":"PK","index":3,"n_rows":25,"n_cols":17,"rows_kept":25,"cut":false,"hidden":false,"merged":[[5,2,5,3]]}
[]
[]
[null,"Personeelskosten per medewerker",null,null,null,null,null,null,null,null,"Januari"]
[null,null,null,null,null,null,null,null,null,null,"Februari"]
[null,null,null,null,null,null,null,null,null,null,"April"]
[null,"Gegevens medewerker","Elise Dijkstra",null,{"$f":"IF(C6=\"Naam\",\"Kies een naam of voer een naam in!\",\"\")","v":""},null,null,null,null,null,"Oktober",null,null,null,"Pensioengrondslag",null,{"$f":"#REF!-#REF!","v":{"$error":"#REF!"}}]
[null,null,null,null,null,null,null,null,null,null,"November"]
[null,"Medewerkernummer: ",null,{"$f":"_xlfn.XLOOKUP(C6, personeelsoverzicht!E:E, personeelsoverzicht!A:A)","v":"EMP00100"},null,null,null,null,null,null,"December"]
{"$rows_left_out":18}
{"sheet":"personeelsoverzicht","index":4,"n_rows":104,"n_cols":36,"rows_kept":104,"cut":false,"hidden":true,"merged":[]}
["Medewerker ID","Voornaam","Tussenv.","Achternaam","Naam","Geslacht","Geboortedatum","Leeftijd","Adres","Postcode","Woonplaats","Afdeling","Functietitel","Datum in dienst","Aantal dienstjaren","Type contract ","Afgeronde dienstjaren","Einde contract","Aantal contracten","FTE","Uren per week","CAO-schaal","Uurloon","Bruto maandsalaris","Jaarlijkse salarisstijging","Vakantiegeld","vakantie uren","Start datum ziekte","Arbeidskorting","Jaarsalaris","inhouding premie","Inhouding pensioen","Heffingskorting ","Belastbaar maandsalaris","Loonheffing","Minimumloon"]
["EMP00005","Marco",null,"Willems",{"$f":"B2 & IF(C2=\"\", \" \", \" \" & C2 & \" \") & D2","v":"Marco Willems"},"M","1997-01-13",{"$f":"(TODAY()-Tabel1[[#This Row],[Geboortedatum]])/365.25","v":28.402464065708418},"Rijnlaan 164","3622 EF","Culemborg","Commercie en financïen ","Accountmanager","2020-03-12",{"$f":"(TODAY()-Tabel1[[#This Row],[Datum in dienst]])/365.25","v":5.2429842573579739},"Vast",{"$f":"ROUNDDOWN(Tabel1[[#This Row],[Aantal dienstjaren]],0)","v":5},"Onbepaalde tijd",3,1,{"$f":"40*Tabel1[[#This Row],[FTE]]","v":40},"UTA 5",{"$f":"(MIN(Lonen!C16*(Tabel1[[#This Row],[Jaarlijkse salarisstijging]])^Tabel1[[#This Row],[Aantal dienstjaren]],Lonen!D16))/174.08","v":25.573639606751922},{"$f":"(MIN(Lonen!C15*(personeelsoverzicht!Y2)^Tabel1[[#This Row],[Afgeronde dienstjaren]],Lonen!D15))*Tabel1[[#This Row],[FTE]]","v":3833.4875088952399},1.03,{"$f":"Tabel1[[#This Row],[Bruto maandsalaris]]*8%","v":306.67900071161921},null,"NVT",{"$f":"ABS(IF(Tabel1[[#This Row],[Jaarsalaris]]<=12169,0.08053*Tabel1[[#This Row],[Jaarsalaris]],IF(Tabel1[[#This Row],[Jaarsalaris]]<=26288,980+0.3003*(Tabel1[[#This Row],[Jaarsalaris]]-12169),IF(Tabel1[[#This Row],[Jaarsalaris]]<=43071,5220+0.02258*(Tabel1[[#This Row],[Jaarsalaris]]-26288),IF(Tabel1[[#This Row],[Jaarsalaris]]<=129078,5599-0.0651*(Tabel1[[#This Row],[Jaarsalaris]]-43071),0)))))/12","v":429.88680176849653},{"$f":"Tabel1[[#This Row],[Bruto maandsalaris]]*13","v":49835.33761563812},{"$f":"-Tabel1[[#This Row],[Bruto maandsalaris]]*0.08%","v":-3.0667900071161922},{"$f":"-((Tabel1[[#This Row],[Jaarsalaris]]-18475)*9.4%)/12","v":-245.65597798916528},{"$f":"IF(Tabel1[[#This Row],[Jaarsalaris]]<=28406, 3068, IF(AD2<=76817, 3068 - 0.06337 * (AD2 - 28406), 0))/12","v":142.50190627475104},{"$f":"Tabel1[[#This Row],[Bruto maandsalaris]]+Tabel1[[#This Row],[inhouding premie]]+Tabel1[[#This Row],[Inhouding pensioen]]","v":3584.7647408989583},{"$f":"-IF(Tabel1[[#This Row],[Belastbaar maandsalaris]]*12<=38441, Tabel1[[#This Row],[Belastbaar maandsalaris]]*0.3582, IF(Tabel1[[#This Row],[Belastbaar maandsalaris]]*12<=76817, (38441*0.3582 + (Tabel1[[#This Row],[Belastbaar maandsalaris]]*12-38441)*0.3748)/12, (38441*0.3582 + (76817-38441)*0.3748 + (Tabel1[[#This Row],[Belastbaar maandsalaris]]*12-76817)*0.495)/12))+Tabel1[[#This Row],[Heffingskorting ]]","v":-1147.8912019475122},{"$f":"Lonen!C15/(40*4.33)","v":19.092378752886837}]
["EMP00095","Lucas","de","Boer","Lucas de Boer","M","1993-07-24",{"$f":"(TODAY()-Tabel1[[#This Row],[Geboortedatum]])/365.25","v":31.876796714579054},"Zonstraat 21","3772 GH","IJsselstein","Commercie en financïen ","Accountmanager","2020-01-24",{"$f":"(TODAY()-Tabel1[[#This Row],[Datum in dienst]])/365.25","v":5.3744010951403149},"Vast",{"$f":"ROUNDDOWN(Tabel1[[#This Row],[Aantal dienstjaren]],0)","v":5},"Onbepaalde tijd",3,1,{"$f":"40*Tabel1[[#This Row],[FTE]]","v":40},"UTA 5",{"$f":"(MIN(Lonen!C16*(Tabel1[[#This Row],[Jaarlijkse salarisstijging]])^Tabel1[[#This Row],[Aantal dienstjaren]],Lonen!D16))/174.08","v":25.673174228904578},{"$f":"(MIN(Lonen!C14*(Tabel1[[#This Row],[Jaarlijkse salarisstijging]])^Tabel1[[#This Row],[Aantal dienstjaren]],Lonen!D14))*Tabel1[[#This Row],[FTE]]","v":3421.0039862064082},1.03,{"$f":"Tabel1[[#This Row],[Bruto maandsalaris]]*8%","v":273.68031889651263},null,"NVT",{"$f":"ABS(IF(Tabel1[[#This Row],[Jaarsalaris]]<=12169,0.08053*Tabel1[[#This Row],[Jaarsalaris]],IF(Tabel1[[#This Row],[Jaarsalaris]]<=26288,980+0.3003*(Tabel1[[#This Row],[Jaarsalaris]]-12169),IF(Tabel1[[#This Row],[Jaarsalaris]]<=43071,5220+0.02258*(Tabel1[[#This Row],[Jaarsalaris]]-26288),IF(Tabel1[[#This Row],[Jaarsalaris]]<=129078,5599-0.0651*(Tabel1[[#This Row],[Jaarsalaris]]-43071),0)))))/12","v":458.97720220612638},{"$f":"Tabel1[[#This Row],[Bruto maandsalaris]]*13","v":44473.051820683308},{"$f":"-Tabel1[[#This Row],[Bruto maandsalaris]]*0.08%","v":-2.7368031889651268},{"$f":"-((Tabel1[[#This Row],[Jaarsalaris]]-18475)*9.4%)/12","v":-203.6514059286859},{"$f":"IF(Tabel1[[#This Row],[Jaarsalaris]]<=28406, 3068, IF(AD3<=76817, 3068 - 0.06337 * (AD3 - 28406), 0))/12","v":170.81924384360823},{"$f":"Tabel1[[#This Row],[Bruto maandsalaris]]+Tabel1[[#This Row],[inhouding premie]]+Tabel1[[#This Row],[Inhouding pensioen]]","v":3214.6157770887571},{"$f":"-IF(Tabel1[[#This Row],[Belastbaar maandsalaris]]*12<=38441, Tabel1[[#This Row],[Belastbaar maandsalaris]]*0.3582, IF(Tabel1[[#This Row],[Belastbaar maandsalaris]]*12<=76817, (38441*0.3582 + (Tabel1[[#This Row],[Belastbaar maandsalaris]]*12-38441)*0.3748)/12, (38441*0.3582 + (76817-38441)*0.3748 + (Tabel1[[#This Row],[Belastbaar maandsalaris]]*12-76817)*0.495)/12))+Tabel1[[#This Row],[Heffingskorting ]]","v":-980.84203274259141},{"$f":"Lonen!C14/(40*4.33)","v":16.850519630484992}]
["EMP00090","Elma","de","Vries","Elma de Vries","V","1998-12-02",{"$f":"(TODAY()-Tabel1[[#This Row],[Geboortedatum]])/365.25","v":26.518822724161534},"Kastanjelaan 186","3845 EF","Leusden","Commercie en financïen ","Administratief medewerker","2020-09-02",{"$f":"(TODAY()-Tabel1[[#This Row],[Datum in dienst]])/365.25","v":4.7665982203969888},"Vast",{"$f":"ROUNDDOWN(Tabel1[[#This Row],[Aantal dienstjaren]],0)","v":4},"Onbepaalde tijd",2,0.8,{"$f":"40*Tabel1[[#This Row],[FTE]]","v":32},"UTA 5",{"$f":"(MIN(Lonen!C16*(Tabel1[[#This Row],[Jaarlijkse salarisstijging]])^Tabel1[[#This Row],[Aantal dienstjaren]],Lonen!D16))/174.08","v":25.21605052745366},{"$f":"(MIN(Lonen!C3*(Tabel1[[#This Row],[Jaarlijkse salarisstijging]])^Tabel1[[#This Row],[Afgeronde dienstjaren]],Lonen!E3)*174.08)*Tabel1[[#This Row],[FTE]]","v":2595.6617436463102},1.03,{"$f":"Tabel1[[#This Row],[Bruto maandsalaris]]*8%","v":207.65293949170481},null,"NVT",{"$f":"ABS(IF(Tabel1[[#This Row],[Jaarsalaris]]<=12169,0.08053*Tabel1[[#This Row],[Jaarsalaris]],IF(Tabel1[[#This Row],[Jaarsalaris]]<=26288,980+0.3003*(Tabel1[[#This Row],[Jaarsalaris]]-12169),IF(Tabel1[[#This Row],[Jaarsalaris]]<=43071,5220+0.02258*(Tabel1[[#This Row],[Jaarsalaris]]-26288),IF(Tabel1[[#This Row],[Jaarsalaris]]<=129078,5599-0.0651*(Tabel1[[#This Row],[Jaarsalaris]]-43071),0)))))/12","v":449.0289590191615},{"$f":"Tabel1[[#This Row],[Bruto maandsalaris]]*13","v":33743.602667402032},{"$f":"-Tabel1[[#This Row],[Bruto maandsalaris]]*0.08%","v":-2.0765293949170482},{"$f":"-((Tabel1[[#This Row],[Jaarsalaris]]-18475)*9.4%)/12","v":-119.60405422798259},{"$f":"IF(Tabel1[[#This Row],[Jaarsalaris]]<=28406, 3068, IF(AD4<=76817, 3068 - 0.06337 * (AD4 - 28406), 0))/12","v":227.47967658056109},{"$f":"Tabel1[[#This Row],[Bruto maandsalaris]]+Tabel1[[#This Row],[inhouding premie]]+Tabel1[[#This Row],[Inhouding pensioen]]","v":2473.9811600234107},{"$f":"-IF(Tabel1[[#This Row],[Belastbaar maandsalaris]]*12<=38441, Tabel1[[#This Row],[Belastbaar maandsalaris]]*0.3582, IF(Tabel1[[#This Row],[Belastbaar maandsalaris]]*12<=76817, (38441*0.3582 + (Tabel1[[#This Row],[Belastbaar maandsalaris]]*12-38441)*0.3748)/12, (38441*0.3582 + (76817-38441)*0.3748 + (Tabel1[[#This Row],[Belastbaar maandsalaris]]*12-76817)*0.495)/12))+Tabel1[[#This Row],[Heffingskorting ]]","v":-658.70037493982466},{"$f":"Lonen!C3","v":16.559999999999999}]
["EMP00102","Sandra",null,"Jansen","Sandra Jansen","V","1994-12-10",{"$f":"(TODAY()-Tabel1[[#This Row],[Geboortedatum]])/365.25","v":30.496919917864478},"Zonstraat 73","3516 GH","Nieuwegein","Commercie en financïen ","Administratief medewerker","2023-10-26",{"$f":"(TODAY()-Tabel1[[#This Row],[Datum in dienst]])/365.25","v":1.6208076659822039},"Vast",{"$f":"ROUNDDOWN(Tabel1[[#This Row],[Aantal dienstjaren]],0)","v":1},"Onbepaalde tijd",3,0.8,{"$f":"40*Tabel1[[#This Row],[FTE]]","v":32},"UTA 5",{"$f":"(MIN(Lonen!C16*(Tabel1[[#This Row],[Jaarlijkse salarisstijging]])^Tabel1[[#This Row],[Aantal dienstjaren]],Lonen!D16))/174.08","v":22.977027594751821},{"$f":"(MIN(Lonen!C3*(Tabel1[[#This Row],[Jaarlijkse salarisstijging]])^Tabel1[[#This Row],[Afgeronde dienstjaren]],Lonen!E3)*174.08)*Tabel1[[#This Row],[FTE]]","v":2375.3981952000004},1.03,{"$f":"Tabel1[[#This Row],[Bruto maandsalaris]]*8%","v":190.03185561600003},null,"NVT",{"$f":"ABS(IF(Tabel1[[#This Row],[Jaarsalaris]]<=12169,0.08053*Tabel1[[#This Row],[Jaarsalaris]],IF(Tabel1[[#This Row],[Jaarsalaris]]<=26288,980+0.3003*(Tabel1[[#This Row],[Jaarsalaris]]-12169),IF(Tabel1[[#This Row],[Jaarsalaris]]<=43071,5220+0.02258*(Tabel1[[#This Row],[Jaarsalaris]]-26288),IF(Tabel1[[#This Row],[Jaarsalaris]]<=129078,5599-0.0651*(Tabel1[[#This Row],[Jaarsalaris]]-43071),0)))))/12","v":443.64094551825065},{"$f":"Tabel1[[#This Row],[Bruto maandsalaris]]*13","v":30880.176537600004},{"$f":"-Tabel1[[#This Row],[Bruto maandsalaris]]*0.08%","v":-1.9003185561600004},{"$f":"-((Tabel1[[#This Row],[Jaarsalaris]]-18475)*9.4%)/12","v":-97.173882877866689},{"$f":"IF(Tabel1[[#This Row],[Jaarsalaris]]<=28406, 3068, IF(AD5<=76817, 3068 - 0.06337 * (AD5 - 28406), 0))/12","v":242.60095273435732},{"$f":"Tabel1[[#This Row],[Bruto maandsalaris]]+Tabel1[[#This Row],[inhouding premie]]+Tabel1[[#This Row],[Inhouding pensioen]]","v":2276.3239937659737},{"$f":"-IF(Tabel1[[#This Row],[Belastbaar maandsalaris]]*12<=38441, Tabel1[[#This Row],[Belastbaar maandsalaris]]*0.3582, IF(Tabel1[[#This Row],[Belastbaar maandsalaris]]*12<=76817, (38441*0.3582 + (Tabel1[[#This Row],[Belastbaar maandsalaris]]*12-38441)*0.3748)/12, (38441*0.3582 + (76817-38441)*0.3748 + (Tabel1[[#This Row],[Belastbaar maandsalaris]]*12-76817)*0.495)/12))+Tabel1[[#This Row],[Heffingskorting ]]","v":-572.77830183261449},{"$f":"Lonen!C3","v":16.559999999999999}]
["EMP00002","Eelco",null,"Bos","Eelco Bos","M","1972-06-08",{"$f":"(TODAY()-Tabel1[[#This Row],[Geboortedatum]])/365.25","v":53.002053388090346},"Kerklaan 146","3845 IJ","Woerden","Uitvoering ","All-round lasser buisleidingen","2011-03-08",{"$f":"(TODAY()-Tabel1[[#This Row],[Datum in dienst]])/365.25","v":14.255989048596852},"Vast",{"$f":"ROUNDDOWN(Tabel1[[#This Row],[Aantal dienstjaren]],0)","v":14},"Onbepaalde tijd",2,1,{"$f":"40*Tabel1[[#This Row],[FTE]]","v":40},"D",{"$f":"MIN(Lonen!C6*(Tabel1[[#This Row],[Jaarlijkse salarisstijging]])^Tabel1[[#This Row],[Afgeronde dienstjaren]],Lonen!E6)","v":25.831000000000003},{"$f":"(MIN(Lonen!C6*(Tabel1[[#This Row],[Jaarlijkse salarisstijging]])^Tabel1[[#This Row],[Afgeronde dienstjaren]],Lonen!E6)*174.08)*Tabel1[[#This Row],[FTE]]","v":4496.6604800000005},1.03,{"$f":"Tabel1[[#This Row],[Bruto maandsalaris]]*8%","v":359.73283840000005},null,"NVT",{"$f":"ABS(IF(Tabel1[[#This Row],[Jaarsalaris]]<=12169,0.08053*Tabel1[[#This Row],[Jaarsalaris]],IF(Tabel1[[#This Row],[Jaarsalaris]]<=26288,980+0.3003*(Tabel1[[#This Row],[Jaarsalaris]]-12169),IF(Tabel1[[#This Row],[Jaarsalaris]]<=43071,5220+0.02258*(Tabel1[[#This Row],[Jaarsalaris]]-26288),IF(Tabel1[[#This Row],[Jaarsalaris]]<=129078,5599-0.0651*(Tabel1[[#This Row],[Jaarsalaris]]-43071),0)))))/12","v":383.11652798133332},{"$f":"Tabel1[[#This Row],[Bruto maandsalaris]]*13","v":58456.586240000004},{"$f":"-Tabel1[[#This Row],[Bruto maandsalaris]]*0.08%","v":-3.5973283840000003},{"$f":"-((Tabel1[[#This Row],[Jaarsalaris]]-18475)*9.4%)/12","v":-313.18909221333337},{"$f":"IF(Tabel1[[#This Row],[Jaarsalaris]]<=28406, 3068, IF(AD6<=76817, 3068 - 0.06337 * (AD6 - 28406), 0))/12","v":96.974529164266656},{"$f":"Tabel1[[#This Row],[Bruto maandsalaris]]+Tabel1[[#This Row],[inhouding premie]]+Tabel1[[#This Row],[Inhouding pensioen]]","v":4179.8740594026667},{"$f":"-IF(Tabel1[[#This Row],[Belastbaar maandsalaris]]*12<=38441, Tabel1[[#This Row],[Belastbaar maandsalaris]]*0.3582, IF(Tabel1[[#This Row],[Belastbaar maandsalaris]]*12<=76817, (38441*0.3582 + (Tabel1[[#This Row],[Belastbaar maandsalaris]]*12-38441)*0.3748)/12, (38441*0.3582 + (76817-38441)*0.3748 + (Tabel1[[#This Row],[Belastbaar maandsalaris]]*12-76817)*0.495)/12))+Tabel1[[#This Row],[Heffingskorting ]]","v":-1416.4655516331861},{"$f":"Lonen!C6","v":19.87}]
["EMP00003","Ayoub","van der","Loo","Ayoub van der Loo","M","1978-06-04",{"$f":"(TODAY()-Tabel1[[#This Row],[Geboortedatum]])/365.25","v":47.014373716632441},"Kastanjelaan 86","3499 IJ","Woudenberg","Uitvoering ","All-round lasser buisleidingen","2010-10-15",{"$f":"(TODAY()-Tabel1[[#This Row],[Datum in dienst]])/365.25","v":14.650239561943874},"Vast",{"$f":"ROUNDDOWN(Tabel1[[#This Row],[Aantal dienstjaren]],0)","v":14},"Onbepaalde tijd",3,1,{"$f":"40*Tabel1[[#This Row],[FTE]]","v":40},"D",{"$f":"MIN(Lonen!C6*(Tabel1[[#This Row],[Jaarlijkse salarisstijging]])^Tabel1[[#This Row],[Afgeronde dienstjaren]],Lonen!E6)","v":25.831000000000003},{"$f":"(MIN(Lonen!C6*(Tabel1[[#This Row],[Jaarlijkse salarisstijging]])^Tabel1[[#This Row],[Afgeronde dienstjaren]],Lonen!E6)*174.08)*Tabel1[[#This Row],[FTE]]","v":4496.6604800000005},1.03,{"$f":"Tabel1[[#This Row],[Bruto maandsalaris]]*8%","v":359.73283840000005},null,"NVT",{"$f":"ABS(IF(Tabel1[[#This Row],[Jaarsalaris]]<=12169,0.08053*Tabel1[[#This Row],[Jaarsalaris]],IF(Tabel1[[#This Row],[Jaarsalaris]]<=26288,980+0.3003*(Tabel1[[#This Row],[Jaarsalaris]]-12169),IF(Tabel1[[#This Row],[Jaarsalaris]]<=43071,5220+0.02258*(Tabel1[[#This Row],[Jaarsalaris]]-26288),IF(Tabel1[[#This Row],[Jaarsalaris]]<=129078,5599-0.0651*(Tabel1[[#This Row],[Jaarsalaris]]-43071),0)))))/12","v":383.11652798133332},{"$f":"Tabel1[[#This Row],[Bruto maandsalaris]]*13","v":58456.586240000004},{"$f":"-Tabel1[[#This Row],[Bruto maandsalaris]]*0.08%","v":-3.5973283840000003},{"$f":"-((Tabel1[[#This Row],[Jaarsalaris]]-18475)*9.4%)/12","v":-313.18909221333337},{"$f":"IF(Tabel1[[#This Row],[Jaarsalaris]]<=28406, 3068, IF(AD7<=76817, 3068 - 0.06337 * (AD7 - 28406), 0))/12","v":96.974529164266656},{"$f":"Tabel1[[#This Row],[Bruto maandsalaris]]+Tabel1[[#This Row],[inhouding premie]]+Tabel1[[#This Row],[Inhouding pensioen]]","v":4179.8740594026667},{"$f":"-IF(Tabel1[[#This Row],[Belastbaar maandsalaris]]*12<=38441, Tabel1[[#This Row],[Belastbaar maandsalaris]]*0.3582, IF(Tabel1[[#This Row],[Belastbaar maandsalaris]]*12<=76817, (38441*0.3582 + (Tabel1[[#This Row],[Belastbaar maandsalaris]]*12-38441)*0.3748)/12, (38441*0.3582 + (76817-38441)*0.3748 + (Tabel1[[#This Row],[Belastbaar maandsalaris]]*12-76817)*0.495)/12))+Tabel1[[#This Row],[Heffingskorting ]]","v":-1416.4655516331861},{"$f":"Lonen!C6","v":19.87}]
["EMP00084","Sanne",null,"Jansen","Sanne Jansen","V","1979-04-04",{"$f":"(TODAY()-Tabel1[[#This Row],[Geboortedatum]])/365.25","v":46.182067077344286},"Laan van Vollenhove 40","3484 GH","Vianen","Staf","Bedrijfsjurist","2012-07-18",{"$f":"(TODAY()-Tabel1[[#This Row],[Datum in dienst]])/365.25","v":12.892539356605065},"Vast",{"$f":"ROUNDDOWN(Tabel1[[#This Row],[Aantal dienstjaren]],0)","v":12},"Onbepaalde tijd",3,0.7,{"$f":"40*Tabel1[[#This Row],[FTE]]","v":28},"UTA 5",{"$f":"(MIN(Lonen!C16*(Tabel1[[#This Row],[Jaarlijkse salarisstijging]])^Tabel1[[#This Row],[Aantal dienstjaren]],Lonen!D16))/174.08","v":30.302619485294116},{"$f":"(MIN(Lonen!C16*(Tabel1[[#This Row],[Jaarlijkse salarisstijging]])^Tabel1[[#This Row],[Aantal dienstjaren]],Lonen!D16))*Tabel1[[#This Row],[FTE]]","v":3692.5559999999996},1.03,{"$f":"Tabel1[[#This Row],[Bruto maandsalaris]]*8%","v":295.40447999999998},null,"NVT",{"$f":"ABS(IF(Tabel1[[#This Row],[Jaarsalaris]]<=12169,0.08053*Tabel1[[#This Row],[Jaarsalaris]],IF(Tabel1[[#This Row],[Jaarsalaris]]<=26288,980+0.3003*(Tabel1[[#This Row],[Jaarsalaris]]-12169),IF(Tabel1[[#This Row],[Jaarsalaris]]<=43071,5220+0.02258*(Tabel1[[#This Row],[Jaarsalaris]]-26288),IF(Tabel1[[#This Row],[Jaarsalaris]]<=129078,5599-0.0651*(Tabel1[[#This Row],[Jaarsalaris]]-43071),0)))))/12","v":439.82599643333333},{"$f":"Tabel1[[#This Row],[Bruto maandsalaris]]*13","v":48003.227999999996},{"$f":"-Tabel1[[#This Row],[Bruto maandsalaris]]*0.08%","v":-2.9540447999999997},{"$f":"-((Tabel1[[#This Row],[Jaarsalaris]]-18475)*9.4%)/12","v":-231.30445266666663},{"$f":"IF(Tabel1[[#This Row],[Jaarsalaris]]<=28406, 3068, IF(AD8<=76817, 3068 - 0.06337 * (AD8 - 28406), 0))/12","v":152.17697180333337},{"$f":"Tabel1[[#This Row],[Bruto maandsalaris]]+Tabel1[[#This Row],[inhouding premie]]+Tabel1[[#This Row],[Inhouding pensioen]]","v":3458.297502533333},{"$f":"-IF(Tabel1[[#This Row],[Belastbaar maandsalaris]]*12<=38441, Tabel1[[#This Row],[Belastbaar maandsalaris]]*0.3582, IF(Tabel1[[#This Row],[Belastbaar maandsalaris]]*12<=76817, (38441*0.3582 + (Tabel1[[#This Row],[Belastbaar maandsalaris]]*12-38441)*0.3748)/12, (38441*0.3582 + (76817-38441)*0.3748 + (Tabel1[[#This Row],[Belastbaar maandsalaris]]*12-76817)*0.495)/12))+Tabel1[[#This Row],[Heffingskorting ]]","v":-1090.8162154794934},{"$f":"Lonen!C16/(40*4.33)","v":22.013452655889147}]
{"$rows_left_out":97}
{"sheet":"po-kort","index":5,"n_rows":104,"n_cols":11,"rows_kept":104,"cut":false,"hidden":true,"merged":[]}
[null,null,"Personeelsoverzicht"]
[{"$f":"Tabel1[[#This Row],[Medewerker ID]]","v":"EMP00005"},{"$f":"Tabel1[[#This Row],[Achternaam]]","v":"Willems"},{"$f":"personeelsoverzicht!E2","v":"Marco Willems"},"Leeftijd",{"$f":"Tabel1[[#This Row],[Geboortedatum]]","v":"1997-01-13"},"Datum in dienst",{"$f":"Tabel1[[#This Row],[Datum in dienst]]","v":"2020-03-12"},"Functie",{"$f":"Tabel1[[#This Row],[Functietitel]]","v":"Accountmanager"},"Afdeling",{"$f":"Tabel1[[#This Row],[Afdeling]]","v":"Commercie en financïen "}]
[{"$f":"Tabel1[[#This Row],[Medewerker ID]]","v":"EMP00095"},{"$f":"Tabel1[[#This Row],[Achternaam]]","v":"Boer"},{"$f":"personeelsoverzicht!E3","v":"Lucas de Boer"},"Leeftijd",{"$f":"Tabel1[[#This Row],[Geboortedatum]]","v":"1993-07-24"},"Datum in dienst",{"$f":"Tabel1[[#This Row],[Datum in dienst]]","v":"2020-01-24"},"Functie",{"$f":"Tabel1[[#This Row],[Functietitel]]","v":"Accountmanager"},"Afdeling",{"$f":"Tabel1[[#This Row],[Afdeling]]","v":"Commercie en financïen "}]
[{"$f":"Tabel1[[#This Row],[Medewerker ID]]","v":"EMP00090"},{"$f":"Tabel1[[#This Row],[Achternaam]]","v":"Vries"},{"$f":"personeelsoverzicht!E4","v":"Elma de Vries"},"Leeftijd",{"$f":"Tabel1[[#This Row],[Geboortedatum]]","v":"1998-12-02"},"Datum in dienst",{"$f":"Tabel1[[#This Row],[Datum in dienst]]","v":"2020-09-02"},"Functie",{"$f":"Tabel1[[#This Row],[Functietitel]]","v":"Administratief medewerker"},"Afdeling",{"$f":"Tabel1[[#This Row],[Afdeling]]","v":"Commercie en financïen "}]
[{"$f":"Tabel1[[#This Row],[Medewerker ID]]","v":"EMP00102"},{"$f":"Tabel1[[#This Row],[Achternaam]]","v":"Jansen"},{"$f":"personeelsoverzicht!E5","v":"Sandra Jansen"},"Leeftijd",{"$f":"Tabel1[[#This Row],[Geboortedatum]]","v":"1994-12-10"},"Datum in dienst",{"$f":"Tabel1[[#This Row],[Datum in dienst]]","v":"2023-10-26"},"Functie",{"$f":"Tabel1[[#This Row],[Functietitel]]","v":"Administratief medewerker"},"Afdeling",{"$f":"Tabel1[[#This Row],[Afdeling]]","v":"Commercie en financïen "}]
[{"$f":"Tabel1[[#This Row],[Medewerker ID]]","v":"EMP00002"},{"$f":"Tabel1[[#This Row],[Achternaam]]","v":"Bos"},{"$f":"personeelsoverzicht!E6","v":"Eelco Bos"},"Leeftijd",{"$f":"Tabel1[[#This Row],[Geboortedatum]]","v":"1972-06-08"},"Datum in dienst",{"$f":"Tabel1[[#This Row],[Datum in dienst]]","v":"2011-03-08"},"Functie",{"$f":"Tabel1[[#This Row],[Functietitel]]","v":"All-round lasser buisleidingen"},"Afdeling",{"$f":"Tabel1[[#This Row],[Afdeling]]","v":"Uitvoering "}]
[{"$f":"Tabel1[[#This Row],[Medewerker ID]]","v":"EMP00003"},{"$f":"Tabel1[[#This Row],[Achternaam]]","v":"Loo"},{"$f":"personeelsoverzicht!E7","v":"Ayoub van der Loo"},"Leeftijd",{"$f":"Tabel1[[#This Row],[Geboortedatum]]","v":"1978-06-04"},"Datum in dienst",{"$f":"Tabel1[[#This Row],[Datum in dienst]]","v":"2010-10-15"},"Functie",{"$f":"Tabel1[[#This Row],[Functietitel]]","v":"All-round lasser buisleidingen"},"Afdeling",{"$f":"Tabel1[[#This Row],[Afdeling]]","v":"Uitvoering "}]
[{"$f":"Tabel1[[#This Row],[Medewerker ID]]","v":"EMP00084"},{"$f":"Tabel1[[#This Row],[Achternaam]]","v":"Jansen"},{"$f":"personeelsoverzicht!E8","v":"Sanne Jansen"},"Leeftijd",{"$f":"Tabel1[[#This Row],[Geboortedatum]]","v":"1979-04-04"},"Datum in dienst",{"$f":"Tabel1[[#This Row],[Datum in dienst]]","v":"2012-07-18"},"Functie",{"$f":"Tabel1[[#This Row],[Functietitel]]","v":"Bedrijfsjurist"},"Afdeling",{"$f":"Tabel1[[#This Row],[Afdeling]]","v":"Staf"}]
{"$rows_left_out":97}
{"sheet":"Loonstrook","index":6,"n_rows":45,"n_cols":10,"rows_kept":45,"cut":false,"hidden":true,"merged":[]}
["GRONDIG",null,null,null,null,"LOONSTROOK "]
["Lage weide 419. 3599 ZZ, Utrecht",null,null,null,null,"Medewerker: ","Michael Krabbe"]
["KvK: 87654321",null,null,null,null,"Medewerkernummer: ",{"$f":"_xlfn.XLOOKUP(G2, personeelsoverzicht!E:E, personeelsoverzicht!A:A)","v":"EMP00008"},null,null,"januari"]
[null,null,null,null,null,"Datum in dienst: ",{"$f":"_xlfn.XLOOKUP(G2, personeelsoverzicht!E:E, personeelsoverzicht!N:N)","v":"2014-02-10"},null,null,"februari"]
[null,null,null,null,null,"Functie: ",{"$f":"_xlfn.XLOOKUP(G2, personeelsoverzicht!E:E,personeelsoverzicht!M:M)","v":"Betonwerker I"},null,null,"maart"]
[null,null,null,null,null,"Afdeling:",{"$f":"_xlfn.XLOOKUP(G2, personeelsoverzicht!E:E,personeelsoverzicht!L:L)","v":"Uitvoering "},null,null,"april"]
[null,null,null,null,null,"Periode:",{"$f":"TODAY()","v":"2025-06-09"},null,null,"mei"]
[null,null,null,null,null,"Datum van:","december",null,null,"juni"]
{"$rows_left_out":38}
{"sheet":"Lonen","index":7,"n_rows":27,"n_cols":6,"rows_kept":27,"cut":false,"hidden":true,"merged":[]}
[]
[null,"Functiegroep","loon p1","p2","Max"]
[null,"A",16.559999999999999,17.43,{"$f":"C3*1.3","v":21.527999999999999}]
[null,"B",17.52,18.420000000000002,{"$f":"C4*1.3","v":22.776}]
[null,"C",18.600000000000001,19.54,{"$f":"C5*1.3","v":24.180000000000003}]
[null,"D",19.87,20.86,{"$f":"C6*1.3","v":25.831000000000003}]
[null,"E",20.85,21.87,{"$f":"C7*1.3","v":27.105000000000004}]
[]
{"$rows_left_out":20}
{"sheet":"GV","index":8,"n_rows":51,"n_cols":4,"rows_kept":51,"cut":false,"hidden":true,"merged":[]}
[]
[null,"Gegevensvelden",null,"jaar en maand"]
[]
[null,2023,null,"2023-01-01"]
[null,2024,null,"2023-02-01"]
[null,2025,null,"2023-03-01"]
[null,2026,null,"2023-04-01"]
[null,null,null,"2023-05-01"]
{"$rows_left_out":43}